Reaction Details
TargetBromodomain-containing protein 4
LigandBDBM50030899
Substrate/Competitorn/a
Meas. Tech.ChEMBL_1442439 (CHEMBL3380069)
IC50 51900±n/a nM
Citation McKeown, MRShaw, DLFu, HLiu, SXu, XMarineau, JJHuang, YZhang, XBuckley, DLKadam, AZhang, ZBlacklow, SCQi, JZhang, WBradner, JE Biased multicomponent reactions to develop novel bromodomain inhibitors. J Med Chem57:9019-27 (2014) 
 
Bromodomain-containing protein 4
Name:Bromodomain-containing protein 4
Type:Protein
Mol. Mass.:152264.84
Organism:Homo sapiens (Human)
Description:O60885
Residue:1362
BDBM50030899
NameBDBM50030899
Synonyms:CHEMBL3356566
TypeSmall organic molecule
Emp. Form.C20H22N6O
Mol. Mass.362.4283
SMILESCc1noc(C)c1-c1ccc(cn1)-c1nc2cnccn2c1NC(C)(C)C