Reaction Details
TargetBromodomain-containing protein 4
LigandBDBM50030915
Substrate/Competitorn/a
Meas. Tech.ChEMBL_1442439 (CHEMBL3380069)
IC50 2860±n/a nM
Citation McKeown, MRShaw, DLFu, HLiu, SXu, XMarineau, JJHuang, YZhang, XBuckley, DLKadam, AZhang, ZBlacklow, SCQi, JZhang, WBradner, JE Biased multicomponent reactions to develop novel bromodomain inhibitors. J Med Chem57:9019-27 (2014) 
 
Bromodomain-containing protein 4
Name:Bromodomain-containing protein 4
Type:Protein
Mol. Mass.:152264.84
Organism:Homo sapiens (Human)
Description:O60885
Residue:1362
BDBM50030915
NameBDBM50030915
Synonyms:CHEMBL3356552
TypeSmall organic molecule
Emp. Form.C25H23N5O
Mol. Mass.409.483
SMILESC[C@H](Nc1c(nc2cnccn12)-c1ccc(cc1)-c1c(C)noc1C)c1ccccc1