Reaction Details
TargetD(3) dopamine receptor
LigandBDBM50031373
Substrate/Competitorn/a
Meas. Tech.ChEMBL_1437145 (CHEMBL3381714)
Ki 0.600000±n/a nM
Citation Brindisi, MButini, SFranceschini, SBrogi, STrotta, FRos, SCagnotto, ASalmona, MCasagni, AAndreassi, MSaponara, SGorelli, BWeikop, PMikkelsen, JDScheel-Kruger, JSandager-Nielsen, KNovellino, ECampiani, GGemma, S Targeting dopamine D3 and serotonin 5-HT1A and 5-HT2A receptors for developing effective antipsychotics: synthesis, biological characterization, and behavioral studies. J Med Chem57:9578-97 (2014) 
 
D(3) dopamine receptor
Name:D(3) dopamine receptor
Type:n/a
Mol. Mass.:44243.43
Organism:Homo sapiens (Human)
Description:n/a
Residue:400
BDBM50031373
NameBDBM50031373
Synonyms:CHEMBL3358509
TypeSmall organic molecule
Emp. Form.C24H28N4O
Mol. Mass.388.5053
SMILESO=C(NCCCCN1CCN(CC1)c1ccccc1)c1ccc2ncccc2c1