Reaction Details
Target5-hydroxytryptamine receptor 1A
LigandBDBM50031464
Substrate/Competitorn/a
Meas. Tech.ChEMBL_1437146 (CHEMBL3381715)
Ki 15±n/a nM
Citation Brindisi, MButini, SFranceschini, SBrogi, STrotta, FRos, SCagnotto, ASalmona, MCasagni, AAndreassi, MSaponara, SGorelli, BWeikop, PMikkelsen, JDScheel-Kruger, JSandager-Nielsen, KNovellino, ECampiani, GGemma, S Targeting dopamine D3 and serotonin 5-HT1A and 5-HT2A receptors for developing effective antipsychotics: synthesis, biological characterization, and behavioral studies. J Med Chem57:9578-97 (2014) 
 
5-hydroxytryptamine receptor 1A
Name:5-hydroxytryptamine receptor 1A
Type:n/a
Mol. Mass.:46122.49
Organism:Homo sapiens (Human)
Description:n/a
Residue:422
BDBM50031464
NameBDBM50031464
Synonyms:CHEMBL3358105
TypeSmall organic molecule
Emp. Form.C23H26FN3O2
Mol. Mass.395.4698
SMILESFc1ccccc1N1CCN(CCCCNC(=O)c2cc3ccccc3o2)CC1