Reaction Details
TargetMelanocortin receptor 4
LigandBDBM50031469
Substrate/Competitorn/a
Meas. Tech.ChEMBL_1438567 (CHEMBL3386098)
EC50 0.067000±n/a nM
Citation Testa, CScrima, MGrimaldi, MD'Ursi, AMDirain, MLLubin-Germain, NSingh, AHaskell-Luevano, CChorev, MRovero, PPapini, AM 1,4-disubstituted-[1,2,3]triazolyl-containing analogues of MT-II: design, synthesis, conformational analysis, and biological activity. J Med Chem57:9424-34 (2014) 
 
Melanocortin receptor 4
Name:Melanocortin receptor 4
Type:PROTEIN
Mol. Mass.:36964.43
Organism:Mus musculus
Description:ChEMBL_1498850
Residue:332
BDBM50031469
NameBDBM50031469
Synonyms:CHEMBL3358552
TypeSmall organic molecule
Emp. Form.C50H67N17O8
Mol. Mass.1034.1761
SMILESCCCC[C@H](NC(C)=O)C(=O)N[C@H]1CCn2cc(CC[C@H](NC(=O)[C@H](Cc3c[nH]c4ccccc34)NC(=O)[C@H](CCCNC(N)=N)NC(=O)[C@@H](Cc3ccccc3)NC(=O)[C@H](Cc3cnc[nH]3)NC1=O)C(N)=O)nn2