Reaction Details
TargetMelanocortin receptor 3
LigandBDBM50031492
Substrate/Competitorn/a
Meas. Tech.ChEMBL_1438566 (CHEMBL3386097)
EC50 0.860000±n/a nM
Citation Testa, CScrima, MGrimaldi, MD'Ursi, AMDirain, MLLubin-Germain, NSingh, AHaskell-Luevano, CChorev, MRovero, PPapini, AM 1,4-disubstituted-[1,2,3]triazolyl-containing analogues of MT-II: design, synthesis, conformational analysis, and biological activity. J Med Chem57:9424-34 (2014) 
 
Melanocortin receptor 3
Name:Melanocortin receptor 3
Type:PROTEIN
Mol. Mass.:35808.24
Organism:Mus musculus
Description:ChEMBL_1498848
Residue:323
BDBM50031492
NameBDBM50031492
Synonyms:CHEMBL3358539
TypeSmall organic molecule
Emp. Form.C51H73N17O8
Mol. Mass.1052.2344
SMILESCCCCC[C@H](NC(=O)[C@H](Cc1c[nH]c2ccccc12)NC(=O)[C@H](CCCNC(N)=N)NC(=O)[C@@H](Cc1ccccc1)NC(=O)[C@H](Cc1cnc[nH]1)NC(=O)[C@H](CCN=[N+]=[N-])NC(=O)[C@H](CCCC)NC(C)=O)C(N)=O