Reaction Details
TargetMelanocyte-stimulating hormone receptor
LigandBDBM50031496
Substrate/Competitorn/a
Meas. Tech.ChEMBL_1438565 (CHEMBL3386096)
EC50 0.820000±n/a nM
Citation Testa, CScrima, MGrimaldi, MD'Ursi, AMDirain, MLLubin-Germain, NSingh, AHaskell-Luevano, CChorev, MRovero, PPapini, AM 1,4-disubstituted-[1,2,3]triazolyl-containing analogues of MT-II: design, synthesis, conformational analysis, and biological activity. J Med Chem57:9424-34 (2014) 
 
Melanocyte-stimulating hormone receptor
Name:Melanocyte-stimulating hormone receptor
Type:PROTEIN
Mol. Mass.:35238.60
Organism:Mus musculus
Description:ChEMBL_1498846
Residue:315
BDBM50031496
NameBDBM50031496
Synonyms:CHEMBL3358535
TypeSmall organic molecule
Emp. Form.C51H73N17O8
Mol. Mass.1052.2344
SMILESCCCCC[C@H](NC(=O)[C@H](CCCC)NC(C)=O)C(=O)N[C@@H](Cc1cnc[nH]1)C(=O)N[C@H](Cc1ccccc1)C(=O)N[C@@H](CCCNC(N)=N)C(=O)N[C@@H](Cc1c[nH]c2ccccc12)C(=O)N[C@@H](CCN=[N+]=[N-])C(N)=O