Reaction Details
TargetMelanocyte-stimulating hormone receptor
LigandBDBM50031498
Substrate/Competitorn/a
Meas. Tech.ChEMBL_1438565 (CHEMBL3386096)
EC50 0.460000±n/a nM
Citation Testa, CScrima, MGrimaldi, MD'Ursi, AMDirain, MLLubin-Germain, NSingh, AHaskell-Luevano, CChorev, MRovero, PPapini, AM 1,4-disubstituted-[1,2,3]triazolyl-containing analogues of MT-II: design, synthesis, conformational analysis, and biological activity. J Med Chem57:9424-34 (2014) 
 
Melanocyte-stimulating hormone receptor
Name:Melanocyte-stimulating hormone receptor
Type:PROTEIN
Mol. Mass.:35238.60
Organism:Mus musculus
Description:ChEMBL_1498846
Residue:315
BDBM50031498
NameBDBM50031498
Synonyms:CHEMBL3358533
TypeSmall organic molecule
Emp. Form.C51H69N17O8
Mol. Mass.1048.2027
SMILESCCCC[C@H](NC(C)=O)C(=O)N[C@@H](CC#C)C(=O)N[C@@H](Cc1cnc[nH]1)C(=O)N[C@H](Cc1ccccc1)C(=O)N[C@@H](CCCNC(N)=N)C(=O)N[C@@H](Cc1c[nH]c2ccccc12)C(=O)N[C@@H](CCCCN=[N+]=[N-])C(N)=O