Reaction Details
TargetMelanocortin receptor 3
LigandBDBM50031486
Substrate/Competitorn/a
Meas. Tech.ChEMBL_1438566 (CHEMBL3386097)
EC50 0.290000±n/a nM
Citation Testa, CScrima, MGrimaldi, MD'Ursi, AMDirain, MLLubin-Germain, NSingh, AHaskell-Luevano, CChorev, MRovero, PPapini, AM 1,4-disubstituted-[1,2,3]triazolyl-containing analogues of MT-II: design, synthesis, conformational analysis, and biological activity. J Med Chem57:9424-34 (2014) 
 
Melanocortin receptor 3
Name:Melanocortin receptor 3
Type:PROTEIN
Mol. Mass.:35808.24
Organism:Mus musculus
Description:ChEMBL_1498848
Residue:323
BDBM50031486
NameBDBM50031486
Synonyms:CHEMBL3358544
TypeSmall organic molecule
Emp. Form.C51H69N17O8
Mol. Mass.1048.2027
SMILESCCCC[C@H](NC(C)=O)C(=O)N[C@H]1CCc2cn(CCC[C@H](NC(=O)[C@H](Cc3c[nH]c4ccccc34)NC(=O)[C@H](CCCNC(N)=N)NC(=O)[C@@H](Cc3ccccc3)NC(=O)[C@H](Cc3cnc[nH]3)NC1=O)C(N)=O)nn2