Reaction Details
TargetAdenosine receptor A2a
LigandBDBM50031501
Substrate/Competitorn/a
Meas. Tech.ChEMBL_1438591 (CHEMBL3386696)
Ki 3500±n/a nM
Citation He, SHong, QLai, ZYang, DXTing, PCKuethe, JTCernak, TADykstra, KDSperbeck, DMWu, ZYu, YYang, GXJian, TLiu, JGuiadeen, DKrikorian, ADSonatore, LMWiltsie, JLiu, JGorski, JNChung, CCGibson, JTLisnock, JXiao, JWolff, MTong, SXMadeira, MKaranam, BVShen, DMBalkovec, JMPinto, SNargund, RPDeVita, RJ Discovery of a Potent and Selective DGAT1 Inhibitor with a Piperidinyl-oxy-cyclohexanecarboxylic Acid Moiety. ACS Med Chem Lett5:1082-7 (2014) 
 
Adenosine receptor A2a
Name:Adenosine receptor A2a
Type:G Protein-Coupled Receptor (GPCR)
Mol. Mass.:44716.46
Organism:Homo sapiens (Human)
Description:P29274
Residue:412
BDBM50031501
NameBDBM50031501
Synonyms:CHEMBL3342773
TypeSmall organic molecule
Emp. Form.C24H27ClN4O3
Mol. Mass.454.949
SMILESOC(=O)[C@H]1CC[C@@H](CC1)OC1CCN(CC1)c1ccc(cn1)-c1nc2cc(Cl)ccc2[nH]1