Reaction Details
TargetDiacylglycerol O-acyltransferase 1
LigandBDBM50031506
Substrate/Competitorn/a
Meas. Tech.ChEMBL_1438588 (CHEMBL3386693)
IC50 11±n/a nM
Citation He, SHong, QLai, ZYang, DXTing, PCKuethe, JTCernak, TADykstra, KDSperbeck, DMWu, ZYu, YYang, GXJian, TLiu, JGuiadeen, DKrikorian, ADSonatore, LMWiltsie, JLiu, JGorski, JNChung, CCGibson, JTLisnock, JXiao, JWolff, MTong, SXMadeira, MKaranam, BVShen, DMBalkovec, JMPinto, SNargund, RPDeVita, RJ Discovery of a Potent and Selective DGAT1 Inhibitor with a Piperidinyl-oxy-cyclohexanecarboxylic Acid Moiety. ACS Med Chem Lett5:1082-7 (2014) 
 
Diacylglycerol O-acyltransferase 1
Name:Diacylglycerol O-acyltransferase 1
Type:Enzyme
Mol. Mass.:56810.61
Organism:Mus musculus (mouse)
Description:In this assay, recombinant mouse DGAT-1 containing an N-terminal His6-epitope tag was produced in the baculovirus expression system.
Residue:498
BDBM50031506
NameBDBM50031506
Synonyms:CHEMBL3342772
TypeSmall organic molecule
Emp. Form.C24H27ClN4O3
Mol. Mass.454.949
SMILESOC(=O)[C@@H]1CC[C@@H](CC1)OC1CCN(CC1)c1ccc(cn1)-c1nc2cc(Cl)ccc2[nH]1