Reaction Details
TargetDiacylglycerol O-acyltransferase 1
LigandBDBM50031503
Substrate/Competitorn/a
Meas. Tech.ChEMBL_1438587 (CHEMBL3386692)
IC50 3.9±n/a nM
Citation He, SHong, QLai, ZYang, DXTing, PCKuethe, JTCernak, TADykstra, KDSperbeck, DMWu, ZYu, YYang, GXJian, TLiu, JGuiadeen, DKrikorian, ADSonatore, LMWiltsie, JLiu, JGorski, JNChung, CCGibson, JTLisnock, JXiao, JWolff, MTong, SXMadeira, MKaranam, BVShen, DMBalkovec, JMPinto, SNargund, RPDeVita, RJ Discovery of a Potent and Selective DGAT1 Inhibitor with a Piperidinyl-oxy-cyclohexanecarboxylic Acid Moiety. ACS Med Chem Lett5:1082-7 (2014) 
 
Diacylglycerol O-acyltransferase 1
Name:Diacylglycerol O-acyltransferase 1
Type:Protein
Mol. Mass.:55297.82
Organism:Homo sapiens (Human)
Description:O75907
Residue:488
BDBM50031503
NameBDBM50031503
Synonyms:CHEMBL3342775
TypeSmall organic molecule
Emp. Form.C25H27F3N4O3
Mol. Mass.488.5021
SMILESOC(=O)[C@H]1CC[C@@H](CC1)OC1CCN(CC1)c1ccc(cn1)-c1nc2cc(ccc2[nH]1)C(F)(F)F