Reaction Details
TargetMalate dehydrogenase, mitochondrial
LigandBDBM50031515
Substrate/Competitorn/a
Meas. Tech.ChEMBL_1440890 (CHEMBL3374593)
IC50>20000±n/a nM
Citation Naik, RWon, MBan, HSBhattarai, DXu, XEo, YHong, YSSingh, SChoi, YAhn, HCLee, K Synthesis and structure-activity relationship study of chemical probes as hypoxia induced factor-1a/malate dehydrogenase 2 inhibitors. J Med Chem57:9522-38 (2014) 
 
Malate dehydrogenase, mitochondrial
Name:Malate dehydrogenase, mitochondrial
Type:PROTEIN
Mol. Mass.:35512.45
Organism:Homo sapiens (Human)
Description:ChEMBL_1456625
Residue:338
BDBM50031515
NameBDBM50031515
Synonyms:CHEMBL3359142
TypeSmall organic molecule
Emp. Form.C18H15NO5
Mol. Mass.325.3154
SMILESOc1ccc(cc1NC(=O)COc1ccccc1)C(=O)OCC#C