Reaction Details
Target2-amino-4-hydroxy-6-hydroxymethyldihydropteridine diphosphokinase
LigandBDBM50031528
Substrate/Competitorn/a
Meas. Tech.ChEMBL_1440909 (CHEMBL3375173)
Kd 42700±n/a nM
Citation Dennis, MLChhabra, SWang, ZCDebono, ADolezal, ONewman, JPitcher, NPRahmani, RCleary, BBarlow, NHattarki, MGraham, BPeat, TSBaell, JBSwarbrick, JD Structure-based design and development of functionalized Mercaptoguanine derivatives as inhibitors of the folate biosynthesis pathway enzyme 6-hydroxymethyl-7,8-dihydropterin pyrophosphokinase from Staphylococcus aureus. J Med Chem57:9612-26 (2014) 
 
2-amino-4-hydroxy-6-hydroxymethyldihydropteridine diphosphokinase
Name:2-amino-4-hydroxy-6-hydroxymethyldihydropteridine diphosphokinase
Type:PROTEIN
Mol. Mass.:18024.64
Organism:Staphylococcus aureus
Description:ChEMBL_109736
Residue:158
BDBM50031528
NameBDBM50031528
Synonyms:CHEMBL3359160
TypeSmall organic molecule
Emp. Form.C8H9N5O2S
Mol. Mass.239.254
SMILESCC(=O)CSc1nc2c(nc(N)[nH]c2=O)[nH]1