Reaction Details
TargetSuppressor of tumorigenicity 14 protein
LigandBDBM50032699
Substrate/Competitorn/a
Meas. Tech.ChEMBL_1441758 (CHEMBL3378881)
Ki 0.140000±n/a nM
Citation Duchêne, DColombo, EDésilets, ABoudreault, PLLeduc, RMarsault, ENajmanovich, R Analysis of subpocket selectivity and identification of potent selective inhibitors for matriptase and matriptase-2. J Med Chem57:10198-204 (2014) 
 
Suppressor of tumorigenicity 14 protein
Name:Suppressor of tumorigenicity 14 protein
Type:Single-pass type II membrane protein
Mol. Mass.:94769.23
Organism:Homo sapiens (Human)
Description:Q9Y5Y6
Residue:855
BDBM50032699
NameBDBM50032699
Synonyms:CHEMBL3354677
TypeSmall organic molecule
Emp. Form.C31H43N11O5S
Mol. Mass.681.809
SMILESC[C@H](NC(=O)[C@H](Cc1ccc(O)cc1)NC(=O)[C@@H](N)CCCNC(N)=N)C(=O)N[C@@H](CCCNC(N)=N)C(=O)c1nc2ccccc2s1