Reaction Details
TargetTransmembrane protease serine 6
LigandBDBM50032697
Substrate/Competitorn/a
Meas. Tech.ChEMBL_1442547 (CHEMBL3371671)
Ki 0.740000±n/a nM
Citation Duchêne, DColombo, EDésilets, ABoudreault, PLLeduc, RMarsault, ENajmanovich, R Analysis of subpocket selectivity and identification of potent selective inhibitors for matriptase and matriptase-2. J Med Chem57:10198-204 (2014) 
 
Transmembrane protease serine 6
Name:Transmembrane protease serine 6
Type:PROTEIN
Mol. Mass.:90001.12
Organism:Homo sapiens (Human)
Description:ChEMBL_1442547
Residue:811
BDBM50032697
NameBDBM50032697
Synonyms:CHEMBL3354675
TypeSmall organic molecule
Emp. Form.C33H46N12O6S
Mol. Mass.738.86
SMILESN[C@@H](CCCNC(N)=N)C(=O)N[C@@H](CCC(N)=O)C(=O)N[C@@H](Cc1ccc(O)cc1)C(=O)N[C@@H](CCCNC(N)=N)C(=O)c1nc2ccccc2s1