Reaction Details
TargetTransmembrane protease serine 6
LigandBDBM50032704
Substrate/Competitorn/a
Meas. Tech.ChEMBL_1442547 (CHEMBL3371671)
Ki 48±n/a nM
Citation Duchêne, DColombo, EDésilets, ABoudreault, PLLeduc, RMarsault, ENajmanovich, R Analysis of subpocket selectivity and identification of potent selective inhibitors for matriptase and matriptase-2. J Med Chem57:10198-204 (2014) 
 
Transmembrane protease serine 6
Name:Transmembrane protease serine 6
Type:PROTEIN
Mol. Mass.:90001.12
Organism:Homo sapiens (Human)
Description:ChEMBL_1442547
Residue:811
BDBM50032704
NameBDBM50032704
Synonyms:CHEMBL3354681
TypeSmall organic molecule
Emp. Form.C28H42N12O5S
Mol. Mass.658.775
SMILESN[C@@H](CCCNC(N)=N)C(=O)N[C@@H](CC(N)=O)C(=O)N1CCC[C@H]1C(=O)N[C@@H](CCCNC(N)=N)C(=O)c1nc2ccccc2s1