Reaction Details
TargetTransmembrane protease serine 6
LigandBDBM50032710
Substrate/Competitorn/a
Meas. Tech.ChEMBL_1442547 (CHEMBL3371671)
Ki 21±n/a nM
Citation Duchêne, DColombo, EDésilets, ABoudreault, PLLeduc, RMarsault, ENajmanovich, R Analysis of subpocket selectivity and identification of potent selective inhibitors for matriptase and matriptase-2. J Med Chem57:10198-204 (2014) 
 
Transmembrane protease serine 6
Name:Transmembrane protease serine 6
Type:PROTEIN
Mol. Mass.:90001.12
Organism:Homo sapiens (Human)
Description:ChEMBL_1442547
Residue:811
BDBM50032710
NameBDBM50032710
Synonyms:CHEMBL3354687
TypeSmall organic molecule
Emp. Form.C31H43N9O5S
Mol. Mass.653.795
SMILESC[C@H](NC(=O)[C@H](CCCCN)NC(=O)[C@@H](N)Cc1ccc(O)cc1)C(=O)N[C@@H](CCCNC(N)=N)C(=O)c1nc2ccccc2s1