Reaction Details
TargetSerine protease hepsin
LigandBDBM50032941
Substrate/Competitorn/a
Meas. Tech.ChEMBL_1432692 (CHEMBL3389936)
Ki 0.550000±n/a nM
Citation Han, ZHarris, PKJones, DEChugani, RKim, TAgarwal, MShen, WWildman, SAJanetka, JW Inhibitors of HGFA, Matriptase, and Hepsin Serine Proteases: A Nonkinase Strategy to Block Cell Signaling in Cancer. ACS Med Chem Lett5:1219-24 (2014) 
 
Serine protease hepsin
Name:Serine protease hepsin
Type:Enzyme
Mol. Mass.:45016.98
Organism:Homo sapiens (Human)
Description:Human deglycosylated hepsin was expressed in Pichia pastoris.
Residue:417
BDBM50032941
NameBDBM50032941
Synonyms:CHEMBL3356600
TypeSmall organic molecule
Emp. Form.C34H50N10O5S
Mol. Mass.710.89
SMILESCC(C)C[C@H](NC(=O)[C@H](CCCCN)NC(=O)[C@H](Cc1c[nH]c2ccccc12)NC(C)=O)C(=O)N[C@@H](CCCNC(N)=N)C(=O)c1nccs1