Reaction Details
TargetHepatocyte growth factor activator
LigandBDBM50063698
Substrate/Competitorn/a
Meas. Tech.ChEMBL_1432699 (CHEMBL3389943)
EC50 490±n/a nM
Citation Han, ZHarris, PKJones, DEChugani, RKim, TAgarwal, MShen, WWildman, SAJanetka, JW Inhibitors of HGFA, Matriptase, and Hepsin Serine Proteases: A Nonkinase Strategy to Block Cell Signaling in Cancer. ACS Med Chem Lett5:1219-24 (2014) 
 
Hepatocyte growth factor activator
Name:Hepatocyte growth factor activator
Type:PROTEIN
Mol. Mass.:70690.18
Organism:Homo sapiens (Human)
Description:ChEMBL_109514
Residue:655
BDBM50063698
NameBDBM50063698
Synonyms:4-Guanidino-benzoic acid 6-carbamimidoyl-naphthalen-2-yl ester CHEMBL273264 | Nafamostat
TypeSmall organic molecule
Emp. Form.C19H17N5O2
Mol. Mass.347.3706
SMILES[#7]\[#6](-[#7])=[#7]/c1ccc(cc1)-[#6](=O)-[#8]-c1ccc2cc(ccc2c1)-[#6](-[#7])=[#7]