Reaction Details
TargetHepatocyte growth factor activator
LigandBDBM50033032
Substrate/Competitorn/a
Meas. Tech.ChEMBL_1432699 (CHEMBL3389943)
EC50 3100±n/a nM
Citation Han, ZHarris, PKJones, DEChugani, RKim, TAgarwal, MShen, WWildman, SAJanetka, JW Inhibitors of HGFA, Matriptase, and Hepsin Serine Proteases: A Nonkinase Strategy to Block Cell Signaling in Cancer. ACS Med Chem Lett5:1219-24 (2014) 
 
Hepatocyte growth factor activator
Name:Hepatocyte growth factor activator
Type:PROTEIN
Mol. Mass.:70690.18
Organism:Homo sapiens (Human)
Description:ChEMBL_109514
Residue:655
BDBM50033032
NameBDBM50033032
Synonyms:CHEMBL3356608
TypeSmall organic molecule
Emp. Form.C23H45N9O6
Mol. Mass.543.6601
SMILESCC(C)C[C@H](NC(=O)[C@H](CCC(N)=O)NC(=O)[C@@H](N)CCCCN)C(=O)N[C@@H](CCCNC(N)=N)C(O)=O