Reaction Details
TargetSuppressor of tumorigenicity 14 protein
LigandBDBM50032932
Substrate/Competitorn/a
Meas. Tech.ChEMBL_1432691 (CHEMBL3389935)
Ki 15±n/a nM
Citation Han, ZHarris, PKJones, DEChugani, RKim, TAgarwal, MShen, WWildman, SAJanetka, JW Inhibitors of HGFA, Matriptase, and Hepsin Serine Proteases: A Nonkinase Strategy to Block Cell Signaling in Cancer. ACS Med Chem Lett5:1219-24 (2014) 
 
Suppressor of tumorigenicity 14 protein
Name:Suppressor of tumorigenicity 14 protein
Type:Single-pass type II membrane protein
Mol. Mass.:94769.23
Organism:Homo sapiens (Human)
Description:Q9Y5Y6
Residue:855
BDBM50032932
NameBDBM50032932
Synonyms:CHEMBL3356593
TypeSmall organic molecule
Emp. Form.C32H49N9O5S
Mol. Mass.671.854
SMILESCC(C)C[C@H](NC(=O)[C@H](Cc1ccccc1)NC(=O)[C@H](CCCCN)NC(C)=O)C(=O)N[C@@H](CCCNC(N)=N)C(=O)c1nccs1