Reaction Details
TargetSuppressor of tumorigenicity 14 protein
LigandBDBM50032933
Substrate/Competitorn/a
Meas. Tech.ChEMBL_1432691 (CHEMBL3389935)
Ki 0.690000±n/a nM
Citation Han, ZHarris, PKJones, DEChugani, RKim, TAgarwal, MShen, WWildman, SAJanetka, JW Inhibitors of HGFA, Matriptase, and Hepsin Serine Proteases: A Nonkinase Strategy to Block Cell Signaling in Cancer. ACS Med Chem Lett5:1219-24 (2014) 
 
Suppressor of tumorigenicity 14 protein
Name:Suppressor of tumorigenicity 14 protein
Type:Single-pass type II membrane protein
Mol. Mass.:94769.23
Organism:Homo sapiens (Human)
Description:Q9Y5Y6
Residue:855
BDBM50032933
NameBDBM50032933
Synonyms:CHEMBL3356592
TypeSmall organic molecule
Emp. Form.C31H46N10O6S
Mol. Mass.686.825
SMILESCC(=O)N[C@@H](CCCCN)C(=O)N[C@@H](CCC(N)=O)C(=O)N[C@@H](Cc1ccccc1)C(=O)N[C@@H](CCCNC(N)=N)C(=O)c1nccs1