Reaction Details
TargetHepatocyte growth factor activator
LigandBDBM50032942
Substrate/Competitorn/a
Meas. Tech.ChEMBL_1432690 (CHEMBL3389934)
Ki 57±n/a nM
Citation Han, ZHarris, PKJones, DEChugani, RKim, TAgarwal, MShen, WWildman, SAJanetka, JW Inhibitors of HGFA, Matriptase, and Hepsin Serine Proteases: A Nonkinase Strategy to Block Cell Signaling in Cancer. ACS Med Chem Lett5:1219-24 (2014) 
 
Hepatocyte growth factor activator
Name:Hepatocyte growth factor activator
Type:PROTEIN
Mol. Mass.:70690.18
Organism:Homo sapiens (Human)
Description:ChEMBL_109514
Residue:655
BDBM50032942
NameBDBM50032942
Synonyms:CHEMBL3356601
TypeSmall organic molecule
Emp. Form.C29H43N9O6S
Mol. Mass.645.773
SMILESCC(=O)N[C@@H](CO)C(=O)N[C@@H](CCCCN)C(=O)N[C@@H](Cc1ccccc1)C(=O)N[C@@H](CCCNC(N)=N)C(=O)c1nccs1