Reaction Details
TargetHepatocyte growth factor activator
LigandBDBM50032940
Substrate/Competitorn/a
Meas. Tech.ChEMBL_1432690 (CHEMBL3389934)
Ki 332±n/a nM
Citation Han, ZHarris, PKJones, DEChugani, RKim, TAgarwal, MShen, WWildman, SAJanetka, JW Inhibitors of HGFA, Matriptase, and Hepsin Serine Proteases: A Nonkinase Strategy to Block Cell Signaling in Cancer. ACS Med Chem Lett5:1219-24 (2014) 
 
Hepatocyte growth factor activator
Name:Hepatocyte growth factor activator
Type:PROTEIN
Mol. Mass.:70690.18
Organism:Homo sapiens (Human)
Description:ChEMBL_109514
Residue:655
BDBM50032940
NameBDBM50032940
Synonyms:CHEMBL3356599
TypeSmall organic molecule
Emp. Form.C26H40N10O6S
Mol. Mass.620.724
SMILESCC(C)C[C@H](NC(=O)[C@H](Cc1cnc[nH]1)NC(=O)[C@H](CO)NC(C)=O)C(=O)N[C@@H](CCCNC(N)=N)C(=O)c1nccs1