Reaction Details
TargetA disintegrin and metalloproteinase with thrombospondin motifs 5
LigandBDBM50033805
Substrate/Competitorn/a
Meas. Tech.ChEMBL_1435760 (CHEMBL3388952)
IC50 330±n/a nM
Citation Durham, TBKlimkowski, VJRito, CJMarimuthu, JToth, JLLiu, CDurbin, JDStout, SLAdams, LSwearingen, CLin, CChambers, MGThirunavukkarasu, KWiley, MR Identification of potent and selective hydantoin inhibitors of aggrecanase-1 and aggrecanase-2 that are efficacious in both chemical and surgical models of osteoarthritis. J Med Chem57:10476-85 (2014) 
 
A disintegrin and metalloproteinase with thrombospondin motifs 5
Name:A disintegrin and metalloproteinase with thrombospondin motifs 5
Type:Enzyme
Mol. Mass.:101769.09
Organism:Homo sapiens (Human)
Description:Q9UNA0
Residue:930
BDBM50033805
NameBDBM50033805
Synonyms:CHEMBL3358155
TypeSmall organic molecule
Emp. Form.C16H11ClN4O4S
Mol. Mass.390.801
SMILESClc1ccc2oc(cc2c1)C(=O)NC[C@]1(NC(=O)NC1=O)c1nccs1