Reaction Details
TargetA disintegrin and metalloproteinase with thrombospondin motifs 5
LigandBDBM50033806
Substrate/Competitorn/a
Meas. Tech.ChEMBL_1435760 (CHEMBL3388952)
IC50 110±n/a nM
Citation Durham, TBKlimkowski, VJRito, CJMarimuthu, JToth, JLLiu, CDurbin, JDStout, SLAdams, LSwearingen, CLin, CChambers, MGThirunavukkarasu, KWiley, MR Identification of potent and selective hydantoin inhibitors of aggrecanase-1 and aggrecanase-2 that are efficacious in both chemical and surgical models of osteoarthritis. J Med Chem57:10476-85 (2014) 
 
A disintegrin and metalloproteinase with thrombospondin motifs 5
Name:A disintegrin and metalloproteinase with thrombospondin motifs 5
Type:Enzyme
Mol. Mass.:101769.09
Organism:Homo sapiens (Human)
Description:Q9UNA0
Residue:930
BDBM50033806
NameBDBM50033806
Synonyms:CHEMBL3358156
TypeSmall organic molecule
Emp. Form.C17H14ClN5O4
Mol. Mass.387.777
SMILESCn1ccnc1[C@]1(CNC(=O)c2cc3cc(Cl)ccc3o2)NC(=O)NC1=O