Reaction Details
TargetCarbonic anhydrase 1
LigandBDBM50035167
Substrate/Competitorn/a
Meas. Tech.ChEMBL_1432722 (CHEMBL3390526)
Ki 813±n/a nM
Citation Ombouma, JVullo, DSupuran, CTWinum, JY Ferrier sulfamidoglycosylation of glycals catalyzed by nitrosonium tetrafluoroborate: towards new carbonic anhydrase glycoinhibitors. Bioorg Med Chem22:6353-9 (2014) 
 
Carbonic anhydrase 1
Name:Carbonic anhydrase 1
Type:Enzyme
Mol. Mass.:28873.37
Organism:Homo sapiens (Human)
Description:P00915
Residue:261
BDBM50035167
NameBDBM50035167
Synonyms:CHEMBL3343177
TypeSmall organic molecule
Emp. Form.C10H16N2O8S
Mol. Mass.324.308
SMILESCC(=O)OC[C@H]1OC(NS(=O)(=O)NO)C=C[C@@H]1OC(C)=O