Reaction Details
TargetCarbonic anhydrase 1
LigandBDBM50035172
Substrate/Competitorn/a
Meas. Tech.ChEMBL_1432722 (CHEMBL3390526)
Ki>10000±n/a nM
Citation Ombouma, JVullo, DSupuran, CTWinum, JY Ferrier sulfamidoglycosylation of glycals catalyzed by nitrosonium tetrafluoroborate: towards new carbonic anhydrase glycoinhibitors. Bioorg Med Chem22:6353-9 (2014) 
 
Carbonic anhydrase 1
Name:Carbonic anhydrase 1
Type:Enzyme
Mol. Mass.:28873.37
Organism:Homo sapiens (Human)
Description:P00915
Residue:261
BDBM50035172
NameBDBM50035172
Synonyms:CHEMBL3343322
TypeSmall organic molecule
Emp. Form.C6H12N2O6S
Mol. Mass.240.234
SMILESOC[C@H]1OC(NS(=O)(=O)NO)C=C[C@@H]1O