Reaction Details
TargetCarbonic anhydrase 2
LigandBDBM50035168
Substrate/Competitorn/a
Meas. Tech.ChEMBL_1432723 (CHEMBL3390527)
Ki 86±n/a nM
Citation Ombouma, JVullo, DSupuran, CTWinum, JY Ferrier sulfamidoglycosylation of glycals catalyzed by nitrosonium tetrafluoroborate: towards new carbonic anhydrase glycoinhibitors. Bioorg Med Chem22:6353-9 (2014) 
 
Carbonic anhydrase 2
Name:Carbonic anhydrase 2
Type:Enzyme
Mol. Mass.:29250.71
Organism:Homo sapiens (Human)
Description:P00918
Residue:260
BDBM50035168
NameBDBM50035168
Synonyms:CHEMBL3343178
TypeSmall organic molecule
Emp. Form.C10H16N2O8S
Mol. Mass.324.308
SMILESCC(=O)OC[C@H]1OC(NS(=O)(=O)NO)C=C[C@H]1OC(C)=O