Reaction Details
TargetCarbonic anhydrase 9
LigandBDBM50035175
Substrate/Competitorn/a
Meas. Tech.ChEMBL_1432724 (CHEMBL3390528)
Ki 9.0±n/a nM
Citation Ombouma, JVullo, DSupuran, CTWinum, JY Ferrier sulfamidoglycosylation of glycals catalyzed by nitrosonium tetrafluoroborate: towards new carbonic anhydrase glycoinhibitors. Bioorg Med Chem22:6353-9 (2014) 
 
Carbonic anhydrase 9
Name:Carbonic anhydrase 9
Type:Enzyme
Mol. Mass.:49669.03
Organism:Homo sapiens (Human)
Description:Catalytic domain of human cloned isozyme was used in the assay
Residue:459
BDBM50035175
NameBDBM50035175
Synonyms:CHEMBL3343325
TypeSmall organic molecule
Emp. Form.C5H10N2O5S
Mol. Mass.210.208
SMILESONS(=O)(=O)NC1OC[C@H](O)C=C1