Reaction Details
TargetCarbonic anhydrase 12
LigandBDBM50035168
Substrate/Competitorn/a
Meas. Tech.ChEMBL_1432725 (CHEMBL3390529)
Ki 207±n/a nM
Citation Ombouma, JVullo, DSupuran, CTWinum, JY Ferrier sulfamidoglycosylation of glycals catalyzed by nitrosonium tetrafluoroborate: towards new carbonic anhydrase glycoinhibitors. Bioorg Med Chem22:6353-9 (2014) 
 
Carbonic anhydrase 12
Name:Carbonic anhydrase 12
Type:Enzyme
Mol. Mass.:39456.00
Organism:Homo sapiens (Human)
Description:Catalytic domain of human cloned isozyme was used in the assay
Residue:354
BDBM50035168
NameBDBM50035168
Synonyms:CHEMBL3343178
TypeSmall organic molecule
Emp. Form.C10H16N2O8S
Mol. Mass.324.308
SMILESCC(=O)OC[C@H]1OC(NS(=O)(=O)NO)C=C[C@H]1OC(C)=O