Reaction Details
TargetMatrix metalloproteinase-17
LigandBDBM50035472
Substrate/Competitorn/a
Meas. Tech.ChEMBL_1441830 (CHEMBL3380041)
IC50 3260±n/a nM
Citation Matusiak, NCastelli, RTuin, AWOverkleeft, HSWisastra, RDekker, FJPrély, LMBischoff, RBischoff, RPvan Waarde, ADierckx, RAElsinga, PH A dual inhibitor of matrix metalloproteinases and a disintegrin and metalloproteinases, [¹8F]FB-ML5, as a molecular probe for non-invasive MMP/ADAM-targeted imaging. Bioorg Med Chem23:192-202 (2014) 
 
Matrix metalloproteinase-17
Name:Matrix metalloproteinase-17
Type:PROTEIN
Mol. Mass.:66652.56
Organism:Homo sapiens (Human)
Description:ChEMBL_1433225
Residue:603
BDBM50035472
NameBDBM50035472
Synonyms:CHEMBL3355724
TypeSmall organic molecule
Emp. Form.C37H43F2N5O7
Mol. Mass.707.7634
SMILESCC(C)C[C@H](CC(=O)NOC(=O)c1ccc(F)cc1)C(=O)N[C@@H](Cc1ccccc1)C(=O)N[C@@H](CCCCNC(=O)c1ccc(F)cc1)C(N)=O