Reaction Details
TargetSerine racemase
LigandBDBM50038338
Substrate/Competitorn/a
Meas. Tech.ChEMBL_1441161 (CHEMBL3378825)
IC50 7030000±n/a nM
Citation Vorlová, BNachtigallová, DJirásková-Vanícková, JAjani, HJansa, PRezác, JFanfrlík, JOtyepka, MHobza, PKonvalinka, JLep?ík, M Malonate-based inhibitors of mammalian serine racemase: kinetic characterization and structure-based computational study. Eur J Med Chem89:189-97 (2014) 
 
Serine racemase
Name:Serine racemase
Type:PROTEIN
Mol. Mass.:36355.92
Organism:Mus musculus
Description:ChEMBL_1441161
Residue:339
BDBM50038338
NameBDBM50038338
Synonyms:CHEMBL3360550
TypeSmall organic molecule
Emp. Form.C7H6O4S
Mol. Mass.186.185
SMILESOC(=O)C(C(O)=O)c1ccsc1