Reaction Details
TargetSerine racemase
LigandBDBM50038341
Substrate/Competitorn/a
Meas. Tech.ChEMBL_1441161 (CHEMBL3378825)
IC50 1850000±n/a nM
Citation Vorlová, BNachtigallová, DJirásková-Vanícková, JAjani, HJansa, PRezác, JFanfrlík, JOtyepka, MHobza, PKonvalinka, JLep?ík, M Malonate-based inhibitors of mammalian serine racemase: kinetic characterization and structure-based computational study. Eur J Med Chem89:189-97 (2014) 
 
Serine racemase
Name:Serine racemase
Type:PROTEIN
Mol. Mass.:36355.92
Organism:Mus musculus
Description:ChEMBL_1441161
Residue:339
BDBM50038341
NameBDBM50038341
Synonyms:CHEBI:30860 | METHYLMALONIC ACID
TypeSmall organic molecule
Emp. Form.C4H6O4
Mol. Mass.118.088
SMILESCC(C(O)=O)C(O)=O