Reaction Details
TargetSerine racemase
LigandBDBM50038342
Substrate/Competitorn/a
Meas. Tech.ChEMBL_1441161 (CHEMBL3378825)
IC50 780000±n/a nM
Citation Vorlová, BNachtigallová, DJirásková-Vanícková, JAjani, HJansa, PRezác, JFanfrlík, JOtyepka, MHobza, PKonvalinka, JLep?ík, M Malonate-based inhibitors of mammalian serine racemase: kinetic characterization and structure-based computational study. Eur J Med Chem89:189-97 (2014) 
 
Serine racemase
Name:Serine racemase
Type:PROTEIN
Mol. Mass.:36355.92
Organism:Mus musculus
Description:ChEMBL_1441161
Residue:339
BDBM50038342
NameBDBM50038342
Synonyms:CHEMBL3360547
TypeSmall organic molecule
Emp. Form.C3HClNa2O4
Mol. Mass.182.47
SMILES[Na+].[Na+].[O-]C(=O)C(Cl)C([O-])=O