Reaction Details
TargetSerine racemase
LigandBDBM50038343
Substrate/Competitorn/a
Meas. Tech.ChEMBL_1441161 (CHEMBL3378825)
IC50 57000±n/a nM
Citation Vorlová, BNachtigallová, DJirásková-Vanícková, JAjani, HJansa, PRezác, JFanfrlík, JOtyepka, MHobza, PKonvalinka, JLep?ík, M Malonate-based inhibitors of mammalian serine racemase: kinetic characterization and structure-based computational study. Eur J Med Chem89:189-97 (2014) 
 
Serine racemase
Name:Serine racemase
Type:PROTEIN
Mol. Mass.:36355.92
Organism:Mus musculus
Description:ChEMBL_1441161
Residue:339
BDBM50038343
NameBDBM50038343
Synonyms:CHEMBL3360546
TypeSmall organic molecule
Emp. Form.C3Cl2Na2O4
Mol. Mass.216.915
SMILES[Na+].[Na+].[O-]C(=O)C(Cl)(Cl)C([O-])=O