Reaction Details
TargetSerine racemase
LigandBDBM50038354
Substrate/Competitorn/a
Meas. Tech.ChEMBL_1441161 (CHEMBL3378825)
IC50 94000±n/a nM
Citation Vorlová, BNachtigallová, DJirásková-Vanícková, JAjani, HJansa, PRezác, JFanfrlík, JOtyepka, MHobza, PKonvalinka, JLep?ík, M Malonate-based inhibitors of mammalian serine racemase: kinetic characterization and structure-based computational study. Eur J Med Chem89:189-97 (2014) 
 
Serine racemase
Name:Serine racemase
Type:PROTEIN
Mol. Mass.:36355.92
Organism:Mus musculus
Description:ChEMBL_1441161
Residue:339
BDBM50038354
NameBDBM50038354
Synonyms:CHEBI:16513 | CHEMBL1794676
TypeSmall organic molecule
Emp. Form.C3H4O5
Mol. Mass.120.0609
SMILESOC(C(O)=O)C(O)=O