Reaction Details
TargetC-C chemokine receptor type 3
LigandBDBM50041184
Substrate/Competitorn/a
Meas. Tech.ChEMBL_1445730 (CHEMBL3374867)
Ki 4600±n/a nM
Citation Kriegl, JMMartyres, DGrundl, MAAnderskewitz, RDollinger, HRast, GSchmid, BSeither, PTautermann, CS Rodent selectivity of piperidine-4-yl-1H-indoles, a series of CC chemokine receptor-3 (CCR3) antagonists: insights from a receptor model. Bioorg Med Chem Lett25:229-35 (2014) 
 
C-C chemokine receptor type 3
Name:C-C chemokine receptor type 3
Type:PROTEIN
Mol. Mass.:41648.91
Organism:Rattus norvegicus
Description:ChEMBL_1445730
Residue:359
BDBM50041184
NameBDBM50041184
Synonyms:CHEMBL3355943
TypeSmall organic molecule
Emp. Form.C23H27FN2OS
Mol. Mass.398.537
SMILESOCc1[nH]c2ccccc2c1C1CCN(CCCSc2ccc(F)cc2)CC1