Reaction Details
TargetC-C chemokine receptor type 3
LigandBDBM50041193
Substrate/Competitorn/a
Meas. Tech.ChEMBL_1445728 (CHEMBL3374865)
Ki 4.7±n/a nM
Citation Kriegl, JMMartyres, DGrundl, MAAnderskewitz, RDollinger, HRast, GSchmid, BSeither, PTautermann, CS Rodent selectivity of piperidine-4-yl-1H-indoles, a series of CC chemokine receptor-3 (CCR3) antagonists: insights from a receptor model. Bioorg Med Chem Lett25:229-35 (2014) 
 
C-C chemokine receptor type 3
Name:C-C chemokine receptor type 3
Type:Enzyme
Mol. Mass.:41053.88
Organism:Homo sapiens (Human)
Description:P51677
Residue:355
BDBM50041193
NameBDBM50041193
Synonyms:CHEMBL3355954
TypeSmall organic molecule
Emp. Form.C31H32F2N6S
Mol. Mass.558.688
SMILESCCc1c(C2CCN(CCCSc3ccc(F)cc3)CC2)c2ccc(F)cc2n1-c1ccc(cc1)-c1nnn[nH]1