Reaction Details
TargetC-C chemokine receptor type 3
LigandBDBM50041090
Substrate/Competitorn/a
Meas. Tech.ChEMBL_1445728 (CHEMBL3374865)
Ki 11±n/a nM
Citation Kriegl, JMMartyres, DGrundl, MAAnderskewitz, RDollinger, HRast, GSchmid, BSeither, PTautermann, CS Rodent selectivity of piperidine-4-yl-1H-indoles, a series of CC chemokine receptor-3 (CCR3) antagonists: insights from a receptor model. Bioorg Med Chem Lett25:229-35 (2014) 
 
C-C chemokine receptor type 3
Name:C-C chemokine receptor type 3
Type:Enzyme
Mol. Mass.:41053.88
Organism:Homo sapiens (Human)
Description:P51677
Residue:355
BDBM50041090
NameBDBM50041090
Synonyms:CHEMBL3355964
TypeSmall organic molecule
Emp. Form.C28H35Cl2FN4O
Mol. Mass.533.508
SMILESCCNC(=O)N[C@@H](CCN1CCC(CC1)c1c(CC)[nH]c2cc(F)ccc12)Cc1ccc(Cl)c(Cl)c1