Reaction Details
TargetProbable C-C chemokine receptor type 3
LigandBDBM50041192
Substrate/Competitorn/a
Meas. Tech.ChEMBL_1445729 (CHEMBL3374866)
Ki 120±n/a nM
Citation Kriegl, JMMartyres, DGrundl, MAAnderskewitz, RDollinger, HRast, GSchmid, BSeither, PTautermann, CS Rodent selectivity of piperidine-4-yl-1H-indoles, a series of CC chemokine receptor-3 (CCR3) antagonists: insights from a receptor model. Bioorg Med Chem Lett25:229-35 (2014) 
 
Probable C-C chemokine receptor type 3
Name:Probable C-C chemokine receptor type 3
Type:PROTEIN
Mol. Mass.:41791.57
Organism:Mus musculus
Description:ChEMBL_1445729
Residue:359
BDBM50041192
NameBDBM50041192
Synonyms:CHEMBL3355953
TypeSmall organic molecule
Emp. Form.C31H32F2N2O2S
Mol. Mass.534.66
SMILESCCc1c(C2CCN(CCCSc3ccc(F)cc3)CC2)c2ccc(F)cc2n1-c1ccc(cc1)C(O)=O