Reaction Details
TargetSubstance-P receptor
LigandBDBM50436553
Substrate/Competitorn/a
Meas. Tech.ChEMBL_1445790 (CHEMBL3375499)
Ki 2.2±n/a nM
Citation Fransson, RNordvall, GBylund, JCarlsson-Jonsson, AKratz, JMSvensson, RArtursson, PHallberg, MSandström, A Exploration and pharmacokinetic profiling of phenylalanine based carbamates as novel substance p 1-7 analogues. ACS Med Chem Lett5:1272-7 (2014) 
 
Substance-P receptor
Name:Substance-P receptor
Type:G Protein-Coupled Receptor (GPCR)
Mol. Mass.:46254.43
Organism:Homo sapiens (Human)
Description:P25103
Residue:407
BDBM50436553
NameBDBM50436553
Synonyms:CHEMBL2396664
TypeSmall organic molecule
Emp. Form.C20H23N3O2
Mol. Mass.337.4155
SMILESN[C@@H](Cc1ccccc1)C(=O)N1CC[C@H]([C@H]1C(N)=O)c1ccccc1