Reaction Details
TargetSubstance-P receptor
LigandBDBM50188489
Substrate/Competitorn/a
Meas. Tech.ChEMBL_1445931 (CHEMBL3377915)
Ki 1.5±n/a nM
Citation Fransson, RNordvall, GBylund, JCarlsson-Jonsson, AKratz, JMSvensson, RArtursson, PHallberg, MSandström, A Exploration and pharmacokinetic profiling of phenylalanine based carbamates as novel substance p 1-7 analogues. ACS Med Chem Lett5:1272-7 (2014) 
 
Substance-P receptor
Name:Substance-P receptor
Type:G Protein-Coupled Receptor (GPCR)
Mol. Mass.:46254.43
Organism:Homo sapiens (Human)
Description:P25103
Residue:407
BDBM50188489
NameBDBM50188489
Synonyms:(S)-2-Amino-N-((S)-1-carbamoyl-2-phenyl-ethyl)-3-phenyl-propionamide H-Phe-Phe-NH2 | Phe-Phe
TypeSmall organic molecule
Emp. Form.C18H21N3O2
Mol. Mass.311.3782
SMILESN[C@@H](Cc1ccccc1)C(=O)N[C@@H](Cc1ccccc1)C(N)=O