Reaction Details
TargetHexokinase-4
LigandBDBM50041606
Substrate/Competitorn/a
Meas. Tech.ChEMBL_1445934 (CHEMBL3377918)
EC50 14±n/a nM
Citation Du, XHinklin, RJXiong, YDransfield, PPark, JKohn, TJPattaropong, VLai, SFu, ZJiao, XChow, DJin, LDavda, JVeniant, MMAnderson, DABaer, BRBencsik, JRBoyd, SAChicarelli, MJMohr, PJWang, BCondroski, KRDeWolf, WEConn, MTran, TYang, JAicher, TDMedina, JCCoward, PHouze, JB C5-Alkyl-2-methylurea-Substituted Pyridines as a New Class of Glucokinase Activators. ACS Med Chem Lett5:1284-9 (2014) 
 
Hexokinase-4
Name:Hexokinase-4
Type:Enzyme
Mol. Mass.:52175.81
Organism:Homo sapiens (Human)
Description:P35557
Residue:465
BDBM50041606
NameBDBM50041606
Synonyms:CHEMBL3358432
TypeSmall organic molecule
Emp. Form.C21H28N4O2
Mol. Mass.368.4726
SMILESCCc1ncccc1Oc1cc(CC2CCCCC2)cnc1NC(=O)NC