Reaction Details
TargetInduced myeloid leukemia cell differentiation protein Mcl-1
LigandBDBM50013867
Substrate/Competitorn/a
Meas. Tech.ChEMBL_1446101 (CHEMBL3380328)
IC50 180±n/a nM
Citation Fang, CD'Souza, BThompson, CFClifton, MCFairman, JWFulroth, BLeed, AMcCarren, PWang, LWang, YFeau, CKaushik, VKPalmer, MWei, GGolub, TRHubbard, BKSerrano-Wu, MH Single Diastereomer of a Macrolactam Core Binds Specifically to Myeloid Cell Leukemia 1 (MCL1). ACS Med Chem Lett5:1308-12 (2014) 
 
Induced myeloid leukemia cell differentiation protein Mcl-1
Name:Induced myeloid leukemia cell differentiation protein Mcl-1
Type:Membrane; Single-pass membrane protein
Mol. Mass.:37332.87
Organism:Homo sapiens (Human)
Description:Q07820
Residue:350
BDBM50013867
NameBDBM50013867
Synonyms:CHEMBL3265299
TypeSmall organic molecule
Emp. Form.C24H19NO6S2
Mol. Mass.481.541
SMILESOC(=O)CSc1cc(NS(=O)(=O)c2ccc(Oc3ccccc3)cc2)c2ccccc2c1O