Reaction Details
TargetCytochrome P450 3A4
LigandBDBM50041897
Substrate/Competitorn/a
Meas. Tech.ChEMBL_1446329 (CHEMBL3374295)
IC50 100±n/a nM
Citation Harcken, CRiether, DLiu, PRazavi, HPatel, ULee, TBosanac, TWard, YRalph, MChen, ZSouza, DNelson, RMKukulka, AFadra-Khan, TNZuvela-Jelaska, LPatel, MThomson, DSNabozny, GH Optimization of drug-like properties of nonsteroidal glucocorticoid mimetics and identification of a clinical candidate. ACS Med Chem Lett5:1318-23 (2014) 
 
Cytochrome P450 3A4
Name:Cytochrome P450 3A4
Type:Enzyme
Mol. Mass.:57349.57
Organism:Homo sapiens (Human)
Description:n/a
Residue:503
BDBM50041897
NameBDBM50041897
Synonyms:CHEMBL3358921
TypeSmall organic molecule
Emp. Form.C22H24F4N2O
Mol. Mass.408.4324
SMILESCc1c(CC(O)(CC(C)(C)c2cc(F)ccc2C)C(F)(F)F)[nH]c2cnccc12