Reaction Details
TargetGlucocorticoid receptor
LigandBDBM50041909
Substrate/Competitorn/a
Meas. Tech.ChEMBL_1446325 (CHEMBL3374291)
IC50 7.0±n/a nM
Citation Harcken, CRiether, DLiu, PRazavi, HPatel, ULee, TBosanac, TWard, YRalph, MChen, ZSouza, DNelson, RMKukulka, AFadra-Khan, TNZuvela-Jelaska, LPatel, MThomson, DSNabozny, GH Optimization of drug-like properties of nonsteroidal glucocorticoid mimetics and identification of a clinical candidate. ACS Med Chem Lett5:1318-23 (2014) 
 
Glucocorticoid receptor
Name:Glucocorticoid receptor
Type:Enzyme
Mol. Mass.:85656.87
Organism:Homo sapiens (Human)
Description:P04150
Residue:777
BDBM50041909
NameBDBM50041909
Synonyms:CHEMBL3358930
TypeSmall organic molecule
Emp. Form.C22H23F4N3O2
Mol. Mass.437.4305
SMILESCc1ccc(F)cc1C(C)(C)CC(O)(Cc1cc2cc(ncc2[nH]1)C(N)=O)C(F)(F)F