Reaction Details
TargetPotassium voltage-gated channel subfamily H member 2
LigandBDBM50041973
Substrate/Competitorn/a
Meas. Tech.ChEMBL_1446331 (CHEMBL3374297)
IC50 20000±n/a nM
Citation Harcken, CRiether, DLiu, PRazavi, HPatel, ULee, TBosanac, TWard, YRalph, MChen, ZSouza, DNelson, RMKukulka, AFadra-Khan, TNZuvela-Jelaska, LPatel, MThomson, DSNabozny, GH Optimization of drug-like properties of nonsteroidal glucocorticoid mimetics and identification of a clinical candidate. ACS Med Chem Lett5:1318-23 (2014) 
 
Potassium voltage-gated channel subfamily H member 2
Name:Potassium voltage-gated channel subfamily H member 2
Type:Multi-pass membrane protein
Mol. Mass.:126672.65
Organism:Homo sapiens (Human)
Description:Q12809
Residue:1159
BDBM50041973
NameBDBM50041973
Synonyms:CHEMBL3358937
TypeSmall organic molecule
Emp. Form.C25H30F3N3O4S
Mol. Mass.525.584
SMILESCC(C)(CC(O)(Cc1cc2cc(ncc2[nH]1)N1CCOCC1)C(F)(F)F)c1ccccc1S(C)(=O)=O