Reaction Details
TargetHigh affinity cAMP-specific 3',5'-cyclic phosphodiesterase 7A
LigandBDBM50042037
Substrate/Competitorn/a
Meas. Tech.ChEMBL_1443874 (CHEMBL3374135)
IC50 1.1±n/a nM
Citation Endo, YKawai, KAsano, TAmano, SAsanuma, YSawada, KOgura, KNagata, NUeo, NTakahashi, NSonoda, YKamei, N Discovery and SAR study of 2-(4-pyridylamino)thieno[3,2-d]pyrimidin-4(3H)-ones as soluble and highly potent PDE7 inhibitors. Bioorg Med Chem Lett25:649-53 (2015) 
 
High affinity cAMP-specific 3',5'-cyclic phosphodiesterase 7A
Name:High affinity cAMP-specific 3',5'-cyclic phosphodiesterase 7A
Type:Enzyme
Mol. Mass.:55514.96
Organism:Homo sapiens (Human)
Description:Q13946
Residue:482
BDBM50042037
NameBDBM50042037
Synonyms:CHEMBL3360169
TypeSmall organic molecule
Emp. Form.C20H22FN5O3S
Mol. Mass.431.484
SMILESCCn1c(Nc2ccncc2F)nc2c(csc2c1=O)C1CCN(CC1)C(=O)OC